BDBM50441892 TACALCITOL
SMILES CC(C)[C@H](O)CC[C@@H](C)[C@H]1CC[C@H]2\C(CCC[C@]12C)=C\C=C1\C[C@@H](O)C[C@H](O)C1=C
InChI Key InChIKey=BJYLYJCXYAMOFT-RSFVBTMBSA-N
Data  1 EC50
  Tab Delimited (TSV)   2D SDfile   Computed 3D by Vconf -m prep SDfile
Find this compound or compounds like it in BindingDB:
Activity Spreadsheet -- Enzyme Inhibition Constant Data from BindingDB
Found 1 hit for monomerid = 50441892
TargetVitamin D3 receptor(Homo sapiens (Human))
China Pharmaceutical University
Curated by ChEMBL
LigandPNGBDBM50441892(TACALCITOL)
Affinity DataEC50:  7.10nM. Assay description: Agonist activity at VDR in human HL60 cells assessed as induction of cell differentiation after 96 hrs by NBT reduction assay
In DepthDetails ArticlePubMed